Target
Phosphatidylinositol 3-kinase regulatory subunit alpha [Q431L,Q432E,D433V,Q434L,V435F,V436Q,K437G,E438P]/4,5-bisphosphate 3-kinase catalytic subunit alpha isoform
Ligand
BDBM207521
Substrate
Meas. Tech.
Biochemical Assay
Ki
<0.018±n/a nM
Citation
 Chen, PCheng, HDeal, JGGallego, GMJalaie, MKath, JCOrr, STShen, HZehnder, LR Dihydropyrrolopyrimidine derivatives US Patent  US9260439 Publication Date 2/16/2016 
Target
Name:
Phosphatidylinositol 3-kinase regulatory subunit alpha [Q431L,Q432E,D433V,Q434L,V435F,V436Q,K437G,E438P]/4,5-bisphosphate 3-kinase catalytic subunit alpha isoform
Synonyms:
p110alpha-iSH2 p85alpha Complex
Type:
Protein
Mol. Mass.:
Description:
Components:
This complex has 2 components.
Component 1
Name:
Phosphatidylinositol 4,5-bisphosphate 3-kinase catalytic subunit alpha isoform
Synonyms:
P42336 PI3-kinase subunit p110-alpha PIK3CA Phosphatidylinositol 3-kinase alpha (PI3Kalpha) Phosphatidylinositol 4,5-bisphosphate 3-kinase (PI3K) Phosphatidylinositol 4,5-bisphosphate 3-kinase catalytic subunit alpha (PI3Kalpha) Phosphatidylinositol 4,5-bisphosphate 3-kinase catalytic subunit alpha isoform (PI3-Ka) Phosphatidylinositol 4,5-bisphosphate 3-kinase catalytic subunit alpha isoform (PI3K p110alpha) Phosphatidylinositol 4,5-bisphosphate 3-kinase catalytic subunit alpha isoform (PI3K-alpha) Phosphatidylinositol 4,5-bisphosphate 3-kinase catalytic subunit alpha isoform (PI3Kalpha p110alpha) Phosphatidylinositol 4,5-bisphosphate 3-kinase catalytic subunit alpha isoform (PIK3CA) Phosphatidylinositol-4,5-bisphosphate 3-kinase catalytic subunit alpha isoform Phosphoinositide 3-Kinase (PI3K), alpha Chain A Phosphoinositide 3-kinases (PI3K) PtdIns-3-kinase p110 | p110 alpha
Type:
Enzyme Subunit
Mol. Mass.:
124294.87
Organism:
Homo sapiens (Human)
Description:
P42336
Residue:
1068
  
Component 2
Name:
Phosphatidylinositol 3-kinase regulatory subunit alpha [Q431L,Q432E,D433V,Q434L,V435F,V436Q,K437G,E438P]
Synonyms:
GRB1 PI3-kinase subunit p85-alpha | PIK3R1
Type:
Protein
Mol. Mass.:
83521.83
Organism:
Homo sapiens (Human)
Description:
Aminoacids 431-438 of p85α replaced with LEVLFQGP
Residue:
724
  
Inhibitor
Name:
BDBM207521
Synonyms:
US9260439, 405
Type:
Small organic molecule
Emp. Form.:
C22H30N8O3
Mol. Mass.:
454.5254
SMILES:
CCOC(=O)N1CC[C@@](C)(C1)N1CCc2c1nc(nc2-c1cnc(N)nc1)N1CCOCC1
: