Target
Poly [ADP-ribose] polymerase 2
Ligand
BDBM207557
Substrate
Meas. Tech.
PARP-2 and PARP-3 Enzymatic Assay
IC50
1.1±n/a nM
Citation
 Zhou, CRen, BWang, H Fused tetra or penta-cyclic dihydrodiazepinocarbazolones as PARP inhibitors US Patent  US9260440 Publication Date 2/16/2016 
Target
Name:
Poly [ADP-ribose] polymerase 2
Synonyms:
(ARTD2 or PARP2) ADPRTL2 PARP2_HUMAN Poly [ADP-ribose] polymerase 2 (PARP2)
Type:
Enzyme
Mol. Mass.:
66225.70
Organism:
Homo sapiens (Human)
Description:
Q9UGN5
Residue:
583
  
Inhibitor
Name:
BDBM207557
Synonyms:
US9260440, 2 | US9617273, Example 2
Type:
Small organic molecule
Emp. Form.:
C14H13N3O
Mol. Mass.:
239.2725
SMILES:
O=c1[nH]nc2CCCCc3[nH]c4cccc1c4c23
: