Target
Poly [ADP-ribose] polymerase 2
Ligand
BDBM207571
Substrate
Meas. Tech.
PARP-2 and PARP-3 Enzymatic Assay
IC50
0.7±n/a nM
Citation
 Zhou, CRen, BWang, H Fused tetra or penta-cyclic dihydrodiazepinocarbazolones as PARP inhibitors US Patent  US9260440 Publication Date 2/16/2016 
Target
Name:
Poly [ADP-ribose] polymerase 2
Synonyms:
(ARTD2 or PARP2) ADPRTL2 PARP2_HUMAN Poly [ADP-ribose] polymerase 2 (PARP2)
Type:
Enzyme
Mol. Mass.:
66225.70
Organism:
Homo sapiens (Human)
Description:
Q9UGN5
Residue:
583
  
Inhibitor
Name:
BDBM207571
Synonyms:
US10501467, Example 16 US9617273, Example 16
Type:
Small organic molecule
Emp. Form.:
C15H14FN3O
Mol. Mass.:
271.2896
SMILES:
CC1(C)Cc2[nH]c3ccc(F)c4c3c2c(C1)n[nH]c4=O
: