Target
Poly [ADP-ribose] polymerase 2
Ligand
BDBM207581
Substrate
Meas. Tech.
PARP-2 and PARP-3 Enzymatic Assay
IC50
0.9±n/a nM
Citation
 Zhou, CRen, BWang, H Fused tetra or penta-cyclic dihydrodiazepinocarbazolones as PARP inhibitors US Patent  US9260440 Publication Date 2/16/2016 
Target
Name:
Poly [ADP-ribose] polymerase 2
Synonyms:
(ARTD2 or PARP2) ADPRTL2 PARP2_HUMAN Poly [ADP-ribose] polymerase 2 (PARP2)
Type:
Enzyme
Mol. Mass.:
66225.70
Organism:
Homo sapiens (Human)
Description:
Q9UGN5
Residue:
583
  
Inhibitor
Name:
BDBM207581
Synonyms:
US10501467, Example 26 US9617273, Example 26
Type:
Small organic molecule
Emp. Form.:
C15H12FN3O2
Mol. Mass.:
285.2731
SMILES:
CC1(C)Cc2n[nH]c(=O)c3cc(F)cc4[nH]c(C1=O)c2c34
: