Target
Alpha-synuclein
Ligand
BDBM207872
Substrate
Meas. Tech.
In Vitro Inhibition Assay
EC50
84±n/a nM
Citation
 Griffioen, GVan Dooren, TRojas De La Parra, VAllasia, SMarchand, AKilonda, AChaltin, P Compounds for the treatment of neurodegenerative diseases US Patent  US9266832 Publication Date 2/23/2016 
Target
Name:
Alpha-synuclein
Synonyms:
NACP SNCA | SYUA_HUMAN
Type:
Protein
Mol. Mass.:
14451.42
Organism:
Homo sapiens (Human)
Description:
P37840
Residue:
140
  
Inhibitor
Name:
BDBM207872
Synonyms:
US9266832, Cpd029
Type:
Small organic molecule
Emp. Form.:
C25H23ClN2O2
Mol. Mass.:
418.915
SMILES:
COc1ccccc1Cc1ccc(cc1)C(=O)NCCc1c[nH]c2ccc(Cl)cc12
: