Target
Alpha-synuclein
Ligand
BDBM207890
Substrate
Meas. Tech.
In Vitro Inhibition Assay
EC50
65±n/a nM
Citation
 Griffioen, GVan Dooren, TRojas De La Parra, VAllasia, SMarchand, AKilonda, AChaltin, P Compounds for the treatment of neurodegenerative diseases US Patent  US9266832 Publication Date 2/23/2016 
Target
Name:
Alpha-synuclein
Synonyms:
NACP SNCA | SYUA_HUMAN
Type:
Protein
Mol. Mass.:
14451.42
Organism:
Homo sapiens (Human)
Description:
P37840
Residue:
140
  
Inhibitor
Name:
BDBM207890
Synonyms:
US9266832, Cpd047
Type:
Small organic molecule
Emp. Form.:
C24H20Cl2N2O
Mol. Mass.:
423.334
SMILES:
Clc1ccc2[nH]cc(CCNC(=O)c3ccc(Cc4ccccc4Cl)cc3)c2c1
: