Target
Alpha-synuclein
Ligand
BDBM207902
Substrate
Meas. Tech.
In Vitro Inhibition Assay
EC50
68±n/a nM
Citation
 Griffioen, GVan Dooren, TRojas De La Parra, VAllasia, SMarchand, AKilonda, AChaltin, P Compounds for the treatment of neurodegenerative diseases US Patent  US9266832 Publication Date 2/23/2016 
Target
Name:
Alpha-synuclein
Synonyms:
NACP SNCA | SYUA_HUMAN
Type:
Protein
Mol. Mass.:
14451.42
Organism:
Homo sapiens (Human)
Description:
P37840
Residue:
140
  
Inhibitor
Name:
BDBM207902
Synonyms:
US9266832, Cpd059
Type:
Small organic molecule
Emp. Form.:
C25H20ClN3O
Mol. Mass.:
413.899
SMILES:
Clc1ccc2[nH]cc(CCNC(=O)c3ccc(Cc4ccccc4C#N)cc3)c2c1
: