Target
Alpha-synuclein
Ligand
BDBM207933
Substrate
Meas. Tech.
In Vitro Inhibition Assay
EC50
91±n/a nM
Citation
 Griffioen, GVan Dooren, TRojas De La Parra, VAllasia, SMarchand, AKilonda, AChaltin, P Compounds for the treatment of neurodegenerative diseases US Patent  US9266832 Publication Date 2/23/2016 
Target
Name:
Alpha-synuclein
Synonyms:
NACP SNCA | SYUA_HUMAN
Type:
Protein
Mol. Mass.:
14451.42
Organism:
Homo sapiens (Human)
Description:
P37840
Residue:
140
  
Inhibitor
Name:
BDBM207933
Synonyms:
US9266832, Cpd090
Type:
Small organic molecule
Emp. Form.:
C24H21ClN2O2
Mol. Mass.:
404.889
SMILES:
Cc1cccc(Oc2cccc(c2)C(=O)NCCc2c[nH]c3ccc(Cl)cc23)c1
: