Target
Alpha-synuclein
Ligand
BDBM207942
Substrate
Meas. Tech.
In Vitro Inhibition Assay
EC50
27±n/a nM
Citation
 Griffioen, GVan Dooren, TRojas De La Parra, VAllasia, SMarchand, AKilonda, AChaltin, P Compounds for the treatment of neurodegenerative diseases US Patent  US9266832 Publication Date 2/23/2016 
Target
Name:
Alpha-synuclein
Synonyms:
NACP SNCA | SYUA_HUMAN
Type:
Protein
Mol. Mass.:
14451.42
Organism:
Homo sapiens (Human)
Description:
P37840
Residue:
140
  
Inhibitor
Name:
BDBM207942
Synonyms:
US9266832, Cpd099
Type:
Small organic molecule
Emp. Form.:
C24H19ClF2N2O
Mol. Mass.:
424.87
SMILES:
Fc1cccc(Cc2ccc(C(=O)NCCc3c[nH]c4ccc(Cl)cc34)c(F)c2)c1
: