Target
Acyl-protein thioesterase 2
Ligand
BDBM207992
Substrate
Meas. Tech.
Steady-State Kinetic Assays
pH
6.5±n/a
Ki
120±20 nM
Comments
extracted
Citation
 Won, SJDavda, DLabby, KJHwang, SYPricer, RMajmudar, JDArmacost, KARodriguez, LARodriguez, CLChong, FSTorossian, KAPalakurthi, JHur, ESMeagher, JLBrooks, CLStuckey, JAMartin, BR Molecular Mechanism for Isoform-Selective Inhibition of Acyl Protein Thioesterases 1 and 2 (APT1 and APT2). ACS Chem Biol 11:3374-3382 (2016)  
Target
Name:
Acyl-protein thioesterase 2
Synonyms:
APT2 LYPA2_HUMAN Lysophospholipase II
Type:
Protein
Mol. Mass.:
24740.23
Organism:
Homo sapiens (Human)
Description:
O95372
Residue:
231
  
Inhibitor
Name:
BDBM207992
Synonyms:
ML349
Type:
Small organic molecule
Emp. Form.:
C23H22N2O4S2
Mol. Mass.:
454.562
SMILES:
COc1ccc(cc1)N1CCN(CC1)C(=O)c1cc2CS(=O)(=O)c3ccccc3-c2s1
: