Target
Uracil-DNA glycosylase
Ligand
BDBM208039
Substrate
Meas. Tech.
Viral Plaque Reduction Assay
Temperature
310.15±n/a K
IC50
23000±n/a nM
Comments
extracted
Citation
 Ricciardi, RPNuth, M Potent poxvirus inhibitor US Patent  US9233921 Publication Date 1/12/2016 
Target
Name:
Uracil-DNA glycosylase
Synonyms:
OPG116 UNG_VACCC | vaccinia virus D4/A20
Type:
Mol. Mass.:
25083.53
Organism:
Vaccinia virus (strain Copenhagen) (VACV)
Description:
P20536
Residue:
218
  
Inhibitor
Name:
BDBM208039
Synonyms:
Methyl 3-((4-chlorophenyl)thio)-7-methyl-1H-indole-2-carboxylate | US9233921, 8
Type:
Small organic molecule
Emp. Form.:
C17H14ClNO2S
Mol. Mass.:
331.817
SMILES:
COC(=O)c1[nH]c2c(C)cccc2c1Sc1ccc(Cl)cc1
: