Target
Genome polyprotein
Ligand
BDBM208264
Substrate
Meas. Tech.
ELISA-Based Assay
IC50
0.6±n/a nM
Citation
 McComas, CCLiverton, NJHabermann, JKoch, UNarjes, FLi, PPeng, XSoll, RWu, HPalani, AHe, SDai, XLiu, HLai, ZLondon, CXiao, DZorn, NNargund, R Tetracyclic heterocycle compounds and methods of use thereof for the treatment of viral diseases US Patent  US9265773 Publication Date 2/23/2016 
Target
Name:
Genome polyprotein
Synonyms:
Dipeptidyl peptidase 4 (DPP4) NS3 NS5B NS3-4A Protease NS3/4A protease POLG_HCV77 | RNA polymerase (NS5B)
Type:
Protease Domain
Mol. Mass.:
327221.49
Organism:
Hepatitis C virus (HCV genotype 1a, isolate H)
Description:
P27958
Residue:
3011
  
Inhibitor
Name:
BDBM208264
Synonyms:
US9265773, 209
Type:
Small organic molecule
Emp. Form.:
C35H26F2N4O8S
Mol. Mass.:
700.665
SMILES:
COC(=O)C(=O)N(C)C(=O)c1c(oc2cc(N(C)S(C)(=O)=O)c(cc12)-c1ccc2OCn3c(cc4c(F)cccc34)-c2n1)-c1ccc(F)cc1
: