Target
Insulin-degrading enzyme
Ligand
BDBM209036
Substrate
Meas. Tech.
IDE Activity Assay
IC50
6e+3±n/a nM
Citation
 Liu, DRMaianti, JPSaghatelian, AKleiner, RE Macrocyclic insulin-degrading enzyme (IDE) inhibitors and uses thereof US Patent  US9243038 Publication Date 1/26/2016 
Target
Name:
Insulin-degrading enzyme
Synonyms:
Abeta-degrading protease IDE Insulin degrading enzyme (hIDE) Insulin-degrading enzyme Insulysin | insulin-degrading enzyme isoform 1 precursor
Type:
Enzyme Catalytic Domain
Mol. Mass.:
117968.59
Organism:
Homo sapiens (Human)
Description:
P14735
Residue:
1019
  
Inhibitor
Name:
BDBM209036
Synonyms:
US9243038, 9
Type:
Small organic molecule
Emp. Form.:
C40H45N7O8
Mol. Mass.:
751.8274
SMILES:
NC(=O)CC[C@@H]1NC(=O)\C=C\C(=O)N[C@@H](CCCCNC(=O)[C@@H](Cc2ccc(cc2)C(=O)c2ccccc2)NC(=O)C(Cc2ccccc2)NC1=O)C(N)=O
: