Target
Insulin-degrading enzyme
Ligand
BDBM209042
Substrate
Meas. Tech.
IDE Activity Assay
IC50
3.7e+2±n/a nM
Citation
 Liu, DRMaianti, JPSaghatelian, AKleiner, RE Macrocyclic insulin-degrading enzyme (IDE) inhibitors and uses thereof US Patent  US9243038 Publication Date 1/26/2016 
Target
Name:
Insulin-degrading enzyme
Synonyms:
Abeta-degrading protease IDE Insulin degrading enzyme (hIDE) Insulin-degrading enzyme Insulysin | insulin-degrading enzyme isoform 1 precursor
Type:
Enzyme Catalytic Domain
Mol. Mass.:
117968.59
Organism:
Homo sapiens (Human)
Description:
P14735
Residue:
1019
  
Inhibitor
Name:
BDBM209042
Synonyms:
US9243038, 16
Type:
Small organic molecule
Emp. Form.:
C39H50N6O7
Mol. Mass.:
714.8503
SMILES:
CC1(C)NC(=O)\C=C\C(=O)NC(CCCCNC(=O)[C@@H](Cc2ccc(cc2)C(=O)c2ccccc2)NC(=O)[C@H](CC2CCCCC2)NC1=O)C(N)=O
: