Target
Diacylglycerol O-acyltransferase 1
Ligand
BDBM209552
Substrate
Meas. Tech.
Inhibition Assay
pH
7.4±n/a
Temperature
298.15±n/a K
IC50
<1±n/a nM
Comments
extracted
Citation
 Kim, DBok, JShin, S Compounds as inhibitors of diacylglycerol O-acyltransferase type 1 enzyme US Patent  US9271969 Publication Date 3/1/2016 
Target
Name:
Diacylglycerol O-acyltransferase 1
Synonyms:
ACAT-related gene product 1 Acyl coA-diacylglycerol acyl transferase 1 (DGAT1) DGAT1 Diacylglycerol Acyltransferase (DGAT1) Diacylglycerol O-acyltransferase 1 (DGAT1) | Diglyceride acyltransferase
Type:
Protein
Mol. Mass.:
55297.82
Organism:
Homo sapiens (Human)
Description:
O75907
Residue:
488
  
Inhibitor
Name:
BDBM209552
Synonyms:
US9271969, 40
Type:
Small organic molecule
Emp. Form.:
C28H24F3N3O3
Mol. Mass.:
507.5037
SMILES:
OC(=O)C[C@H]1CCC(CC1)c1ccc(cc1)-c1ccc2nc(cn2c1)C(=O)Nc1cc(F)c(F)c(F)c1
: