Target
Diacylglycerol O-acyltransferase 1
Ligand
BDBM209526
Substrate
Meas. Tech.
Inhibition Assay
pH
7.4±n/a
Temperature
298.15±n/a K
IC50
<1.0±n/a nM
Comments
extracted
Citation
 Kim, DBok, JShin, S Compounds as inhibitors of diacylglycerol O-acyltransferase type 1 enzyme US Patent  US9271969 Publication Date 3/1/2016 
Target
Name:
Diacylglycerol O-acyltransferase 1
Synonyms:
DGAT1_MOUSE Dgat1 Diacylglycerol O-acyltransferase 1 (DGAT1) | Diglyceride acyltransferase
Type:
Enzyme
Mol. Mass.:
56810.61
Organism:
Mus musculus (mouse)
Description:
In this assay, recombinant mouse DGAT-1 containing an N-terminal His6-epitope tag was produced in the baculovirus expression system.
Residue:
498
  
Inhibitor
Name:
BDBM209526
Synonyms:
US9271969, 14
Type:
Small organic molecule
Emp. Form.:
C30H29N3O5
Mol. Mass.:
511.5684
SMILES:
OC(=O)C[C@H]1CCC(CC1)c1ccc(cc1)-c1ccc2nc(cn2c1)C(=O)NCc1ccc2OCOc2c1
: