Target
Neurogenic locus notch homolog protein 3/Recombining binding protein suppressor of hairless
Ligand
BDBM209909
Substrate
Meas. Tech.
Transactivation Assay
IC50
48.3±n/a nM
Citation
 Gavai, AVDeLucca, GVO'Malley, DGill, PQuesnelle, CAFink, BEZhao, YLee, FY Bis(fluoroalkyl)-1,4-benzodiazepinone compounds and prodrugs thereof US Patent  US9273014 Publication Date 3/1/2016 
Target
Name:
Neurogenic locus notch homolog protein 3/Recombining binding protein suppressor of hairless
Synonyms:
Notch 3-CBF1 | Notch3-CBF1
Type:
Enzyme
Mol. Mass.:
Description:
Components:
This complex has 2 components.
Component 1
Name:
Neurogenic locus notch homolog protein 3
Synonyms:
NOTC3_HUMAN Neurogenic locus notch homolog protein 3 Notch 3 Notch 3 intracellular domain | Notch 3 intracellular domain (Notch 3)
Type:
Enzyyme
Mol. Mass.:
243579.59
Organism:
Homo sapiens (Human)
Description:
Q9UM47
Residue:
2321
  
Component 2
Name:
Recombining binding protein suppressor of hairless
Synonyms:
C-promoter binding factor I (CBF1) IGKJRB1 RBPJK Recombining binding protein suppressor of hairless (CBF1) | SUH_HUMAN
Type:
Enzyme
Mol. Mass.:
55640.53
Organism:
Homo sapiens (Human)
Description:
Q06330
Residue:
500
  
Inhibitor
Name:
BDBM209909
Synonyms:
US9273014, Comparative Compound 45 | US9427442, Comparative Compound 26
Type:
Small organic molecule
Emp. Form.:
C27H34N4O3
Mol. Mass.:
462.5839
SMILES:
CCC[C@@H]([C@@H](CC(C)C)C(=O)N[C@H]1N=C(c2ccccc2)c2ccccc2N(C)C1=O)C(N)=O
: