Target
Ephrin type-A receptor 2 [596-900]
Ligand
BDBM50322535
Substrate
Meas. Tech.
Kinobeads Competition Assay
Kd
6.9±0.0 nM
Citation
 Heinzlmeir, SKudlinzki, DSreeramulu, SKlaeger, SGande, SLLinhard, VWilhelm, MQiao, HHelm, DRuprecht, BSaxena, KMédard, GSchwalbe, HKuster, B Chemical Proteomics and Structural Biology Define EPHA2 Inhibition by Clinical Kinase Drugs. ACS Chem Biol 11:3400-3411 (2016)  
Target
Name:
Ephrin type-A receptor 2 [596-900]
Synonyms:
ECK EPHA2_HUMAN | Ephrin type-A receptor 2 (EPHA2)
Type:
Protein
Mol. Mass.:
34367.96
Organism:
Homo sapiens (Human)
Description:
EPHA2 truncation (596-900 aa); 519U
Residue:
305
  
Inhibitor
Name:
BDBM50322535
Synonyms:
3-(imidazo[1,2-b]pyridazin-3-ylethynyl)-4-methyl-N-{4-[(4-methylpiperazin-1-yl)methyl]-3-(trifluoromethyl)phenyl}benzamide CHEMBL1171837 US10464902, Ponatinib | US9255107, AP24534
Type:
Small organic molecule
Emp. Form.:
C29H27F3N6O
Mol. Mass.:
532.5595
SMILES:
CN1CCN(Cc2ccc(NC(=O)c3ccc(C)c(c3)C#Cc3cnc4cccnn34)cc2C(F)(F)F)CC1
: