Target
Vascular endothelial growth factor receptor 2
Ligand
BDBM5882
Substrate
poly-Glu-Ala-Tyr
Meas. Tech.
Homogeneous Time-resolved Fluorescence (HTRF) Assay
pH
7.4±n/a
Temperature
295.15±n/a K
IC50
1800±n/a nM
Citation
 Curtin, MLFrey, RRHeyman, HRSarris, KASteinman, DHHolmes, JHBousquet, PFCunha, GAMoskey, MDAhmed, AAPease, LJGlaser, KBStewart, KDDavidsen, SKMichaelides, MR Isoindolinone ureas: a novel class of KDR kinase inhibitors. Bioorg Med Chem Lett 14:4505-9 (2004)  
Target
Name:
Vascular endothelial growth factor receptor 2
Synonyms:
CD_antigen=CD309 Fetal liver kinase 1 (FLK-1) KDR Protein-tyrosine kinase receptor Flk-1 VEGFR-2 VEGFR2 Vascular Endothelial Growth Factor Receptor Kinase 2 Vascular endothelial growth factor receptor 2 (KDR) Vascular endothelial growth factor receptor 2 (VEGFR2) Vascular endothelial growth factor receptor-2 (VEGFR-2)
Type:
Receptor Tyrosine Kinase
Mol. Mass.:
151510.97
Organism:
Homo sapiens (Human)
Description:
P35968
Residue:
1356
  
Inhibitor
Name:
BDBM5882
Synonyms:
3-[4-(1-oxo-2,3-dihydro-1H-isoindol-4-yl)phenyl]-1-phenylurea isoindolinone analog 4a
Type:
Small organic molecule
Emp. Form.:
C21H17N3O2
Mol. Mass.:
343.3786
SMILES:
O=C(Nc1ccccc1)Nc1ccc(cc1)-c1cccc2C(=O)NCc12
:
Substrate
Name:
poly-Glu-Ala-Tyr
Synonyms:
poly-Glu-Ala-Tyr-biotin
Type:
Random Copolymer
Mol. Mass.:
358.43
Organism:
Description:
It is a synthetic polymer of glutamic acid, alanine and tyrosine (poly-Glu-Ala-Tyr) that has been biotinylated.
Residue:
3
NA