Target
Amyloid-beta precursor protein
Ligand
BDBM15236
Substrate
Meas. Tech.
Thioflavin-T (Th-T) Fluorescence Assay
pH
7.4±n/a
Temperature
298.15±n/a K
IC50
1.51e+4±n/a nM
Comments
extracted
Citation
 Sato, MMurakami, KUno, MNakagawa, YKatayama, SAkagi, KMasuda, YTakegoshi, KIrie, K Site-specific inhibitory mechanism for amyloid ß42 aggregation by catechol-type flavonoids targeting the Lys residues. J Biol Chem 288:23212-24 (2013)  
Target
Name:
Amyloid-beta precursor protein
Synonyms:
A4 ABPP AICD-50 AICD-59 AID(57) APP Alzheimer disease amyloid protein Amyloid beta Protein Amyloid beta protein Abeta(1-42) Amyloid intracellular domain 57 Amyloid protein (Abeta42b) Beta amyloid A4 protein Beta-APP42 Beta-amyloid protein 42 C83 CVAP Gamma Secretase Gamma-CTF(57) Gamma-secretase Gamma-secretase C-terminal fragment 57 P3(40) PN-II Protease nexin-II S-APP-beta Soluble APP-beta | beta-Amyloid Precursor Protein (APP)
Type:
Single-pass type I membrane protein
Mol. Mass.:
86890.41
Organism:
Homo sapiens (Human)
Description:
P05067
Residue:
770
  
Inhibitor
Name:
BDBM15236
Synonyms:
3,5,7-trihydroxy-2-(3,4,5-trihydroxyphenyl)-4H-chromen-4-one CHEMBL164 Myricetin Myricetin (Myr) | cid_5281672
Type:
Small organic molecule
Emp. Form.:
C15H10O8
Mol. Mass.:
318.2351
SMILES:
Oc1cc(O)c2c(c1)oc(-c1cc(O)c(O)c(O)c1)c(O)c2=O
: