Target
Acetyl-CoA carboxylase 2 [129-967]
Ligand
BDBM212822
Substrate
Meas. Tech.
Spectrophotometric 384 Well Assay
pH
7.5±n/a
IC50
104±n/a nM
Comments
extracted
Citation
 Heine, NFleck, MNosse, BRoth, GJ Pyrrolidine derivatives, pharmaceutical compositions and uses thereof US Patent  US9278954 Publication Date 3/8/2016 
Target
Name:
Acetyl-CoA carboxylase 2 [129-967]
Synonyms:
ACACB ACC2 Acetyl-CoA carboxylase 2 (ACC2)
Type:
Enzyme
Mol. Mass.:
92599.28
Organism:
Homo sapiens (Human)
Description:
O00763 lacks the 128 amino acids at the N-terminus
Residue:
839
  
Inhibitor
Name:
BDBM212822
Synonyms:
US9278954, 8.1
Type:
Small organic molecule
Emp. Form.:
C26H34FN3O2
Mol. Mass.:
439.5655
SMILES:
CCNC(=O)C(C)c1ccc(O[C@@H]2CCN(C2)c2ncc(CC3CCCC3)cc2F)cc1
: