Target
Tyrosine-protein kinase ITK/TSK [357-620,Y512E]
Ligand
BDBM213222
Substrate
Meas. Tech.
LanthaScreen Kinase Binding Assay
IC50
32±0 nM
Citation
 Harling, JDDeakin, AMCampos, SGrimley, RChaudry, LNye, CPolyakova, OBessant, CMBarton, NSomers, DBarrett, JGraves, RHHanns, LKerr, WJSolari, R Discovery of novel irreversible inhibitors of interleukin (IL)-2-inducible tyrosine kinase (Itk) by targeting cysteine 442 in the ATP pocket. J Biol Chem 288:28195-206 (2013)  
Target
Name:
Tyrosine-protein kinase ITK/TSK [357-620,Y512E]
Synonyms:
EMT ITK_HUMAN LYK
Type:
Enzyme
Mol. Mass.:
30027.99
Organism:
Homo sapiens (Human)
Description:
Human Itk truncation (357-620 aa) with Y512E mutation
Residue:
264
  
Inhibitor
Name:
BDBM213222
Synonyms:
(S)-1-(3-((4-((Dimethylamino)methyl)-6-(thiazolo[5,4-b]pyridin-2-ylamino)pyridin-2-yl)amino)pyrrolidin-1-yl)prop-2-en-1-one (11)
Type:
Small organic molecule
Emp. Form.:
C21H25N7OS
Mol. Mass.:
423.535
SMILES:
CN(C)Cc1cc(N[C@H]2CCN(C2)C(=O)C=C)nc(Nc2nc3cccnc3s2)c1
: