Target
Baculoviral IAP repeat-containing protein 2 [256-363]
Ligand
BDBM213391
Substrate
Meas. Tech.
XIAP BIR3 & cIAP1 BIR3 Binding Assays (DELFIA)
Temperature
298.15±n/a K
IC50
12±n/a nM
Comments
extracted
Citation
 Reiser, UMadden, J 6-Alkynyl Pyridine US Patent  US9278978 Publication Date 3/8/2016 
Target
Name:
Baculoviral IAP repeat-containing protein 2 [256-363]
Synonyms:
API1 BIRC2_HUMAN Cellular inhibitor of apoptosis 1 BIR3 domain (c-IAP1 BIR3) MIHB | RNF48
Type:
Enzyme
Mol. Mass.:
12600.71
Organism:
Homo sapiens (Human)
Description:
Human cIAP BIR3 domain (256-363 aa)
Residue:
108
  
Inhibitor
Name:
BDBM213391
Synonyms:
US9278978, 26
Type:
Small organic molecule
Emp. Form.:
C26H25N5O2
Mol. Mass.:
439.509
SMILES:
CN[C@H](C)C(=O)Nc1cc(c(OC)c(n1)C#Cc1ccccc1)-c1cccc2cnn(C)c12
: