Target
Synaptic vesicular amine transporter [P314L]
Ligand
BDBM50017701
Substrate
Meas. Tech.
[3H]TBZOH Binding Assay
pH
7.5±n/a
Temperature
298.15±n/a K
IC50
>200±0 nM
Kd
>100±0 nM
Comments
extracted
Citation
 Ugolev, YSegal, TYaffe, DGros, YSchuldiner, S Identification of conformationally sensitive residues essential for inhibition of vesicular monoamine transport by the noncompetitive inhibitor tetrabenazine. J Biol Chem 288:32160-71 (2013)  
Target
Name:
Synaptic vesicular amine transporter [P314L]
Synonyms:
Slc18a2 VMAT2_RAT Vmat2
Type:
Protein
Mol. Mass.:
55705.63
Organism:
Rattus norvegicus (Rat)
Description:
Rat VMAT2 P314L mutant
Residue:
515
  
Inhibitor
Name:
BDBM50017701
Synonyms:
3-Isobutyl-9,10-dimethoxy-1,3,4,6,7,11b-hexahydro-pyrido[2,1-a]isoquinolin-2-one CHEMBL117785 Tetrabenazine (TBZ)
Type:
Small organic molecule
Emp. Form.:
C19H27NO3
Mol. Mass.:
317.4226
SMILES:
COc1cc2CCN3CC(CC(C)C)C(=O)CC3c2cc1OC
: