Target
Isoform Tau-F of Microtubule-associated protein tau
Ligand
BDBM214744
Substrate
Meas. Tech.
Tau Protein Assay
pH
7.4±n/a
IC50
6.7e+2±n/a nM
Comments
extracted
Citation
 Schafer, KNCisek, KHuseby, CJChang, EKuret, J Structural determinants of Tau aggregation inhibitor potency. J Biol Chem 288:32599-611 (2013)  
Target
Name:
Isoform Tau-F of Microtubule-associated protein tau
Synonyms:
MAPT MTBT1 Microtubule-associated protein Tau isoform 2N4R (Tau 2N4R) TAU | TAU_HUMAN
Type:
Enzyme Catalytic Domain
Mol. Mass.:
45857.42
Organism:
Homo sapiens (Human)
Description:
P10636-8
Residue:
441
  
Inhibitor
Name:
BDBM214744
Synonyms:
Rhodanines, 32A
Type:
Small organic molecule
Emp. Form.:
C22H14ClN3O2S2
Mol. Mass.:
451.948
SMILES:
Clc1cccc(c1)-c1ccc(\C=C2/SC(=S)N(Cc3nc4ccccc4[nH]3)C2=O)o1
: