Target
Isoform Tau-F of Microtubule-associated protein tau
Ligand
BDBM214760
Substrate
Meas. Tech.
Tau Protein Assay
pH
7.4±n/a
IC50
3.50e+3±n/a nM
Comments
extracted
Citation
 Schafer, KNCisek, KHuseby, CJChang, EKuret, J Structural determinants of Tau aggregation inhibitor potency. J Biol Chem 288:32599-611 (2013)  
Target
Name:
Isoform Tau-F of Microtubule-associated protein tau
Synonyms:
MAPT MTBT1 Microtubule-associated protein Tau isoform 2N4R (Tau 2N4R) TAU | TAU_HUMAN
Type:
Enzyme Catalytic Domain
Mol. Mass.:
45857.42
Organism:
Homo sapiens (Human)
Description:
P10636-8
Residue:
441
  
Inhibitor
Name:
BDBM214760
Synonyms:
Rhodanines, 48A
Type:
Small organic molecule
Emp. Form.:
C16H9ClNO6
Mol. Mass.:
346.699
SMILES:
[O-]C(=O)CN1C(=O)O\C(=C/c2ccc(o2)-c2cccc(Cl)c2)C1=O
: