Target
Bifunctional epoxide hydrolase 2
Ligand
BDBM50100543
Substrate
Meas. Tech.
t-DPPO
IC50
63.8±n/a nM
Citation
 Hammock, BDRose, TMorisseau, CLee, KS Acyl piperidine inhibitors of soluble epoxide hydrolase US Patent  US9296693 Publication Date 3/29/2016 
Target
Name:
Bifunctional epoxide hydrolase 2
Synonyms:
Eph2 Epoxide hydratase Soluble epoxide hydrolase (sEH)
Type:
Enzyme
Mol. Mass.:
62512.06
Organism:
Mus musculus (Mouse)
Description:
P34914
Residue:
554
  
Inhibitor
Name:
BDBM50100543
Synonyms:
CHEMBL3327063
Type:
Small organic molecule
Emp. Form.:
C17H22F3N3O2
Mol. Mass.:
357.3707
SMILES:
CCCC(=O)N1CCC(CC1)NC(=O)Nc1ccc(cc1)C(F)(F)F
: