Target
Bifunctional epoxide hydrolase 2
Ligand
BDBM50327809
Substrate
Meas. Tech.
Fluorescent Based Assay
pH
7±n/a
IC50
3.7±n/a nM
Comments
extracted
Citation
 Hammock, BDRose, TMorisseau, CLee, KS Acyl piperidine inhibitors of soluble epoxide hydrolase US Patent  US9296693 Publication Date 3/29/2016 
Target
Name:
Bifunctional epoxide hydrolase 2
Synonyms:
Cytosolic epoxide hydrolase 2 EPHX2 HYES_HUMAN Soluble epoxide hydrolase (sEH) | epoxide hydrolase 2, cytoplasmic
Type:
Enzyme
Mol. Mass.:
62613.07
Organism:
Homo sapiens (Human)
Description:
P34913
Residue:
555
  
Inhibitor
Name:
BDBM50327809
Synonyms:
1-(1-Propionylpiperidin-4-yl)-3-(4-(trifluoromethoxy)phenyl)urea US10383835, Compound 1770 US9296693, 40
Type:
Small organic molecule
Emp. Form.:
C16H20F3N3O3
Mol. Mass.:
359.3435
SMILES:
CCC(=O)N1CCC(CC1)NC(=O)Nc1ccc(OC(F)(F)F)cc1
: