Target
Histone deacetylase 9
Ligand
BDBM32188
Substrate
Meas. Tech.
HDAC Cell-Free Assays
pH
8±n/a
IC50
5.70e+4±n/a nM
Comments
extracted
Citation
 Cao, BLi, JZhu, JShen, MHan, KZhang, ZYu, YWang, YWu, DChen, SSun, ATang, XZhao, YQiao, CHou, TMao, X The antiparasitic clioquinol induces apoptosis in leukemia and myeloma cells by inhibiting histone deacetylase activity. J Biol Chem 288:34181-9 (2013)  
Target
Name:
Histone deacetylase 9
Synonyms:
HD9 HDAC7B HDAC9_HUMAN Histone acetylase 9 (HDAC9) Histone deacetylase 9 (HDAC9) Human HDAC9 MITR
Type:
Enzyme
Mol. Mass.:
111304.31
Organism:
Homo sapiens (Human)
Description:
Q9UKV0
Residue:
1011
  
Inhibitor
Name:
BDBM32188
Synonyms:
CLIOQUINOL TG2-36-2 | cid_2788
Type:
Small organic molecule
Emp. Form.:
C9H5ClINO
Mol. Mass.:
305.5
SMILES:
Oc1c(I)cc(Cl)c2cccnc12
: