Target
Uridine 5'-monophosphate synthase
Ligand
BDBM214781
Substrate
Meas. Tech.
Inhibition Assay
pH
8±n/a
Temperature
298.15±n/a K
Ki
200±90 nM
Comments
extracted
Citation
 Zhang, YEvans, GBClinch, KCrump, DRHarris, LDFröhlich, RFTyler, PCHazleton, KZCassera, MBSchramm, VL Transition state analogues of Plasmodium falciparum and human orotate phosphoribosyltransferases. J Biol Chem 288:34746-54 (2013)  
Target
Name:
Uridine 5'-monophosphate synthase
Synonyms:
Orotate phosphoribosyltransferase (HsOPRT) UMPS | UMPS_HUMAN
Type:
Enzyme
Mol. Mass.:
52224.99
Organism:
Homo sapiens (Human)
Description:
P11172
Residue:
480
  
Inhibitor
Name:
BDBM214781
Synonyms:
OPRT inhibitor, 4
Type:
Small organic molecule
Emp. Form.:
C10H16BrN3O8P
Mol. Mass.:
417.127
SMILES:
OC1C(O)[C@H](Cn2cc(Br)c(=O)[nH]c2=O)[NH2+][C@@H]1COP(O)(O)=O
: