Target
Rho-associated protein kinase 2
Ligand
BDBM217324
Substrate
Meas. Tech.
ROCK2 Kinase Activity Assays
Ki
3.1±n/a nM
Citation
 Curtin, MLSorensen, BKHeyman, HRClark, RFWoller, KRShah, OJMichaelides, MTse, CVasudevan, AMack, HHansen, TMSweis, RPliushchev, MA NAMPT and rock inhibitors US Patent  US9302989 Publication Date 4/5/2016 
Target
Name:
Rho-associated protein kinase 2
Synonyms:
KIAA0619 ROCK2 Rho kinase 2 (ROCKII) Rho-associated protein kinase 2 (ROCK2) Rho-associated protein kinase 2/Transforming protein RhoA Rho-associated, coiled-coil-containing protein kinase II p164 ROCK-2
Type:
Protein
Mol. Mass.:
160885.43
Organism:
Homo sapiens (Human)
Description:
O75116
Residue:
1388
  
Inhibitor
Name:
BDBM217324
Synonyms:
US9302989, 549
Type:
Small organic molecule
Emp. Form.:
C22H17N5O2
Mol. Mass.:
383.4027
SMILES:
O=C(Nc1ccc(cc1)-c1n[nH]c(=O)c2ccccc12)N1Cc2cccnc2C1
: