Target
Phosphatidylinositol 4,5-bisphosphate 3-kinase catalytic subunit delta isoform
Ligand
BDBM217352
Substrate
Meas. Tech.
SelectScreen Biochemical Kinase Assay
IC50
12.7±0.0 nM
Citation
 Shugg, RPThomson, ATanabe, NKashishian, ASteiner, BHPuri, KDPereverzev, ALannutti, BJJirik, FRDixon, SJSims, SM Effects of isoform-selective phosphatidylinositol 3-kinase inhibitors on osteoclasts: actions on cytoskeletal organization, survival, and resorption. J Biol Chem 288:35346-57 (2013)  
Target
Name:
Phosphatidylinositol 4,5-bisphosphate 3-kinase catalytic subunit delta isoform
Synonyms:
PI3-kinase subunit delta PI3K-delta PK3CD_MOUSE Pik3cd PtdIns-3-kinase subunit p110-delta | p110delta
Type:
Enzyme
Mol. Mass.:
119725.20
Organism:
Mus musculus (Mouse)
Description:
O35904
Residue:
1043
  
Inhibitor
Name:
BDBM217352
Synonyms:
GS-9820
Type:
Small organic molecule
Emp. Form.:
C21H16FN7O
Mol. Mass.:
401.3964
SMILES:
C[C@H](Nc1ncnc2[nH]cnc12)c1nc2ccc(F)cc2c(=O)n1-c1ccccc1
: