Target
Phosphatidylinositol 4-phosphate 5-kinase type-1 beta
Ligand
BDBM217352
Substrate
Meas. Tech.
SelectScreen Biochemical Kinase Assay
IC50
>10000±0.0 nM
Citation
 Shugg, RPThomson, ATanabe, NKashishian, ASteiner, BHPuri, KDPereverzev, ALannutti, BJJirik, FRDixon, SJSims, SM Effects of isoform-selective phosphatidylinositol 3-kinase inhibitors on osteoclasts: actions on cytoskeletal organization, survival, and resorption. J Biol Chem 288:35346-57 (2013)  
Target
Name:
Phosphatidylinositol 4-phosphate 5-kinase type-1 beta
Synonyms:
PI51B_MOUSE Pip5k1b
Type:
Enzyme
Mol. Mass.:
60805.07
Organism:
Mus musculus (Mouse)
Description:
P70181
Residue:
539
  
Inhibitor
Name:
BDBM217352
Synonyms:
GS-9820
Type:
Small organic molecule
Emp. Form.:
C21H16FN7O
Mol. Mass.:
401.3964
SMILES:
C[C@H](Nc1ncnc2[nH]cnc12)c1nc2ccc(F)cc2c(=O)n1-c1ccccc1
: