Target
Histone deacetylase 5
Ligand
BDBM22449
Substrate
Meas. Tech.
HDAC Activity Assay
pH
8±n/a
IC50
>30000±n/a nM
Comments
extracted
Citation
 Kozikowski, AKalin, JHButler, KVBergman, JHancock, WW HDAC inhibitors and therapeutic methods using the same US Patent  US9249087 Publication Date 2/2/2016 
Target
Name:
Histone deacetylase 5
Synonyms:
Antigen NY-CO-9 HDAC5 Histone acetylase 5 (HDAC5) Human HDAC5 | KIAA0600
Type:
Enzyme
Mol. Mass.:
121968.61
Organism:
Homo sapiens (Human)
Description:
Q9UQL6
Residue:
1122
  
Inhibitor
Name:
BDBM22449
Synonyms:
CHEMBL356769 Tubacin | US9249087, Tubastatin A
Type:
Small organic molecule
Emp. Form.:
C41H43N3O7S
Mol. Mass.:
721.861
SMILES:
OCc1ccc(cc1)[C@@H]1C[C@H](CSc2nc(c(o2)-c2ccccc2)-c2ccccc2)O[C@@H](O1)c1ccc(NC(=O)CCCCCCC(=O)NO)cc1
: