Target
Metabotropic glutamate receptor 2
Ligand
BDBM160817
Substrate
Meas. Tech.
MGluR2 cAMP Assay
pH
7±n/a
EC50
4.00±n/a nM
Comments
extracted
Citation
 Mattson, RJMeng, ZGuernon, LR Positive allosteric modulators of mGluR2 US Patent  US9682980 Publication Date 6/20/2017 
Target
Name:
Metabotropic glutamate receptor 2
Synonyms:
GPRC1B GRM2_HUMAN Metabotropic glutamate receptor mGlu2 | metabotropic glutamate 2
Type:
Enzyme
Mol. Mass.:
95584.88
Organism:
Homo sapiens (Human)
Description:
Q14416
Residue:
872
  
Inhibitor
Name:
BDBM160817
Synonyms:
US9682980, 2-(1-(3-(Cyclopropylmethyl)-8-(trifluoromethyl)-[1,2,4]triazolo[4,3-b]pyridazin-7-yl)piperidin-4-yl)benzonitrile
Type:
Small organic molecule
Emp. Form.:
C22H21F3N6
Mol. Mass.:
426.4375
SMILES:
FC(F)(F)c1c(cnn2c(CC3CC3)nnc12)N1CCC(CC1)c1ccccc1C#N
: