Target
Metabotropic glutamate receptor 2
Ligand
BDBM160821
Substrate
Meas. Tech.
MGluR2 cAMP Assay
pH
7±n/a
EC50
0.20±n/a nM
Comments
extracted
Citation
 Mattson, RJMeng, ZGuernon, LR Positive allosteric modulators of mGluR2 US Patent  US9682980 Publication Date 6/20/2017 
Target
Name:
Metabotropic glutamate receptor 2
Synonyms:
GPRC1B GRM2_HUMAN Metabotropic glutamate receptor mGlu2 | metabotropic glutamate 2
Type:
Enzyme
Mol. Mass.:
95584.88
Organism:
Homo sapiens (Human)
Description:
Q14416
Residue:
872
  
Inhibitor
Name:
BDBM160821
Synonyms:
US9682980, 3-(Cyclopropylmethyl)-7-(4-(3,6-difluoro-2-methoxyphenyl)piperidin-1-yl)-8-(trifluoromethyl)-[1,2,4]triazolo[4,3-b]pyridazine
Type:
Small organic molecule
Emp. Form.:
C22H22F5N5O
Mol. Mass.:
467.435
SMILES:
COc1c(F)ccc(F)c1C1CCN(CC1)c1cnn2c(CC3CC3)nnc2c1C(F)(F)F
: