Target
Protein kinase C iota type
Ligand
BDBM218806
Substrate
Meas. Tech.
PKC AlphaScreen Assay
pH
7.4±n/a
IC50
3.64e+4± 8e+2 nM
Comments
extracted
Citation
 Arencibia, JMFröhner, WKrupa, MPastor-Flores, DMerker, POellerich, TNeimanis, SSchmithals, CKöberle, VSüß, EZeuzem, SStark, HPiiper, AOdadzic, DSchulze, JOBiondi, RM An Allosteric Inhibitor Scaffold Targeting the PIF-Pocket of Atypical Protein Kinase C Isoforms. ACS Chem Biol 12:564-573 (2017)  
Target
Name:
Protein kinase C iota type
Synonyms:
Atypical protein kinase C-lambda/iota KPCI_HUMAN PRKCI Protein kinase C iota Protein kinase C iota type aPKC-lambda/iota | nPKC-iota
Type:
Enzyme
Mol. Mass.:
68251.56
Organism:
Homo sapiens (Human)
Description:
P41743
Residue:
596
  
Inhibitor
Name:
BDBM218806
Synonyms:
PS267
Type:
Small organic molecule
Emp. Form.:
C18H13ClN2O4S2
Mol. Mass.:
420.89
SMILES:
CCOC(=O)C1=C(O)C(=O)N(C1c1cccs1)c1nc2ccc(Cl)cc2s1
: