Target
Opioid growth factor receptor-like protein 1
Ligand
BDBM220366
Substrate
Meas. Tech.
In Vitro ORL-1 Receptor Binding Assay
pH
7.4±n/a
Temperature
298.15±n/a K
Ki
1.03±0.1 nM
Comments
extracted
Citation
 Tafesse, LTsuno, NZhou, X Azetidine-substituted quinoxalines as opioid receptor like-1 modulators US Patent  US9290488 Publication Date 3/22/2016 
Target
Name:
Opioid growth factor receptor-like protein 1
Synonyms:
OGFRL1 Opioid Receptor-Like Receptor (ORL-1) Opioid growth factor receptor-like protein 1 (ORL1) Opioid receptor-like (ORL1) Opioid receptor-like receptor (ORL1)
Type:
Protein
Mol. Mass.:
51247.53
Organism:
Homo sapiens (Human)
Description:
Q5TC84
Residue:
451
  
Inhibitor
Name:
BDBM220366
Synonyms:
US9290488, B34a
Type:
Small organic molecule
Emp. Form.:
C31H42N4O3
Mol. Mass.:
518.6902
SMILES:
C[C@H]1C[C@H]2C[C@@H](C1)C[C@@H](C2)N1[C@H]2CCC[C@@H]1C[C@@H](C2)n1c2ccccc2nc(N2CC(CC(O)=O)C2)c1=O
: