Target
Opioid growth factor receptor-like protein 1
Ligand
BDBM220371
Substrate
Meas. Tech.
In Vitro ORL-1 Receptor Functional Assay
pH
7.4±n/a
Temperature
298.15±n/a K
EC50
65.7±12.6 nM
Comments
extracted
Citation
 Tafesse, LTsuno, NZhou, X Azetidine-substituted quinoxalines as opioid receptor like-1 modulators US Patent  US9290488 Publication Date 3/22/2016 
Target
Name:
Opioid growth factor receptor-like protein 1
Synonyms:
OGFRL1 Opioid Receptor-Like Receptor (ORL-1) Opioid growth factor receptor-like protein 1 (ORL1) Opioid receptor-like (ORL1) Opioid receptor-like receptor (ORL1)
Type:
Protein
Mol. Mass.:
51247.53
Organism:
Homo sapiens (Human)
Description:
Q5TC84
Residue:
451
  
Inhibitor
Name:
BDBM220371
Synonyms:
US9290488, E53a(i)
Type:
Small organic molecule
Emp. Form.:
C31H42N4O3
Mol. Mass.:
518.6902
SMILES:
CC1(C)[C@@H]2C[C@H]1[C@H](CCN1[C@H]3CCC[C@@H]1C[C@@H](C3)n1c3ccccc3nc(N3CC[C@@H]3C(O)=O)c1=O)CC2
: