Target
Diacylglycerol O-acyltransferase 1
Ligand
BDBM220411
Substrate
Meas. Tech.
PMSA Inhibition Assay
Ki
15.1±7.5 nM
IC50
342.3±170.5 nM
Citation
 Spiegel, DMurelli, RZhang, A Chimeric small molecules for the recruitment of antibodies to cancer cells US Patent  US9296708 Publication Date 3/29/2016 
Target
Name:
Diacylglycerol O-acyltransferase 1
Synonyms:
ACAT-related gene product 1 Acyl coA-diacylglycerol acyl transferase 1 (DGAT1) DGAT1 Diacylglycerol Acyltransferase (DGAT1) Diacylglycerol O-acyltransferase 1 (DGAT1) | Diglyceride acyltransferase
Type:
Protein
Mol. Mass.:
55297.82
Organism:
Homo sapiens (Human)
Description:
O75907
Residue:
488
  
Inhibitor
Name:
BDBM220411
Synonyms:
US9296708, 17
Type:
Small organic molecule
Emp. Form.:
C25H42N6O9
Mol. Mass.:
570.6358
SMILES:
OC(=O)CC[C@H](NC(=O)N[C@@H](CCCCn1cc(COCCOCCNC2CCCCC2)nn1)C(O)=O)C(O)=O
: