Target
Arginase-1
Ligand
BDBM290384
Substrate
Meas. Tech.
Inhibition Assay of Arginase
pH
7.4±n/a
Temperature
298.15±n/a K
IC50
<250±n/a nM
Comments
extracted
Citation
 Van Zandt, MJagdmann, GE Arginase inhibitors as therapeutics US Patent  US10098902 Publication Date 10/16/2018 
Target
Name:
Arginase-1
Synonyms:
ARG1 Liver-type arginase | Type I arginase
Type:
PROTEIN
Mol. Mass.:
34737.53
Organism:
Homo sapiens (Human)
Description:
ChEMBL_978893
Residue:
322
  
Inhibitor
Name:
BDBM290384
Synonyms:
(3R,4S)-1-((1H-imidazol-4-yl)methyl)-3-amino-4-(3- boronopropyl)pyrrolidine-3-carboxylic acid US11389464, Example 20
Type:
Small organic molecule
Emp. Form.:
C12H21BN4O4
Mol. Mass.:
296.131
SMILES:
N[C@]1(CN(Cc2c[nH]cn2)C[C@@H]1CCCB(O)O)C(O)=O
: