Target
Apoptosis regulator Bcl-2
Ligand
BDBM144850
Substrate
Meas. Tech.
Time Resolved-Fluorescence Resonance Energy Transfer (TR-FRET) Assay
Temperature
298.15±n/a K
Ki
1.584±n/a nM
Comments
extracted
Citation
 Bruncko, MDing, HDoherty, GAElmore, SWHasvold, LHexamer, LKunzer, ARMantei, RAPark, CSong, XSouers, AJSullivan, GMTao, ZWang, GTWang, LWang, XWendt, MD Apoptosis-inducing agents for the treatment of cancer and immune and autoimmune diseases US Patent  US9303025 Publication Date 4/5/2016 
Target
Name:
Apoptosis regulator Bcl-2
Synonyms:
Apoptosis regulator Bcl-2 Protein BCL-2 BCL2_HUMAN | Bcl-2 Protein
Type:
Homodimer or heterodimer
Mol. Mass.:
26269.11
Organism:
Homo sapiens (Human)
Description:
P10415
Residue:
239
  
Inhibitor
Name:
BDBM144850
Synonyms:
US8952157, 32 | US9303025, 32
Type:
Small organic molecule
Emp. Form.:
C45H50ClN7O7S
Mol. Mass.:
868.439
SMILES:
CN(C)CCCNc1ccc(cc1[N+]([O-])=O)S(=O)(=O)NC(=O)c1ccc(cc1Oc1cccc(c1)N1CCOCC1)N1CCN(Cc2ccccc2-c2ccc(Cl)cc2)CC1
: