Target
Apoptosis regulator Bcl-2
Ligand
BDBM144854
Substrate
Meas. Tech.
Time Resolved-Fluorescence Resonance Energy Transfer (TR-FRET) Assay
Temperature
298.15±n/a K
Ki
0.07±n/a nM
Comments
extracted
Citation
 Bruncko, MDing, HDoherty, GAElmore, SWHasvold, LHexamer, LKunzer, ARMantei, RAPark, CSong, XSouers, AJSullivan, GMTao, ZWang, GTWang, LWang, XWendt, MD Apoptosis-inducing agents for the treatment of cancer and immune and autoimmune diseases US Patent  US9303025 Publication Date 4/5/2016 
Target
Name:
Apoptosis regulator Bcl-2
Synonyms:
Apoptosis regulator Bcl-2 Protein BCL-2 BCL2_HUMAN | Bcl-2 Protein
Type:
Homodimer or heterodimer
Mol. Mass.:
26269.11
Organism:
Homo sapiens (Human)
Description:
P10415
Residue:
239
  
Inhibitor
Name:
BDBM144854
Synonyms:
US8952157, 36 | US9303025, 36
Type:
Small organic molecule
Emp. Form.:
C44H50Cl2N6O6S
Mol. Mass.:
861.875
SMILES:
CN1CCC(CC1)Nc1ccc(cc1[N+]([O-])=O)S(=O)(=O)NC(=O)c1ccc(cc1Oc1cccc(Cl)c1)N1CCN(CC2=C(CC(C)(C)CC2)c2ccc(Cl)cc2)CC1
: