Target
Apoptosis regulator Bcl-2
Ligand
BDBM145219
Substrate
Meas. Tech.
Time Resolved-Fluorescence Resonance Energy Transfer (TR-FRET) Assay
Temperature
298.15±n/a K
Ki
<0.010±n/a nM
Comments
extracted
Citation
 Bruncko, MDing, HDoherty, GAElmore, SWHasvold, LHexamer, LKunzer, ARMantei, RAPark, CSong, XSouers, AJSullivan, GMTao, ZWang, GTWang, LWang, XWendt, MD Apoptosis-inducing agents for the treatment of cancer and immune and autoimmune diseases US Patent  US9303025 Publication Date 4/5/2016 
Target
Name:
Apoptosis regulator Bcl-2
Synonyms:
Apoptosis regulator Bcl-2 Protein BCL-2 BCL2_HUMAN | Bcl-2 Protein
Type:
Homodimer or heterodimer
Mol. Mass.:
26269.11
Organism:
Homo sapiens (Human)
Description:
P10415
Residue:
239
  
Inhibitor
Name:
BDBM145219
Synonyms:
US8952157, 410 | US9303025, 410
Type:
Small organic molecule
Emp. Form.:
C45H46Cl2F3N5O6S
Mol. Mass.:
912.843
SMILES:
CC1(C)CC(=C(CN2CCN(CC2)c2ccc(C(=O)NS(=O)(=O)c3cnc(OCC4CCC(F)(F)CC4)c(Cl)c3)c(Oc3cc4cc[nH]c4cc3F)c2)CO1)c1ccc(Cl)cc1
: