Target
Cystic fibrosis transmembrane conductance regulator
Ligand
BDBM221996
Substrate
Meas. Tech.
IonWorks Quattro Assay
IC50
1.96±n/a nM
Citation
 Ahmed, MAshall-Kelly, ABloomfield, GCGueritz, LMcKenna, JMcKenna, JMutton, SParmar, RSheperd, JWright, P Substituted pyrazino[1′,2′:1,2]pyrrolo[3,4-d]pyrimidines, pyrimido[4′,5′:3,4]pyrrolo[2,1-c][1,4]oxazines and pyrimido[4′,5′:3,4]pyrrolo[1,2-d][1,4]oxazepines for inhibiting the CFTR channel US Patent  US9303035 Publication Date 4/5/2016 
Target
Name:
Cystic fibrosis transmembrane conductance regulator
Synonyms:
cystic fibrosis transmembrane conductance regulator protein (CFTR)
Type:
Protein
Mol. Mass.:
125499.86
Organism:
Cricetulus griseus (Chinese hamster)
Description:
G3H9J3
Residue:
1107
  
Inhibitor
Name:
BDBM221996
Synonyms:
US9303035, 14
Type:
Small organic molecule
Emp. Form.:
C23H20ClN5O4S
Mol. Mass.:
497.954
SMILES:
Cn1c2c3C(COC(CO)Cn3c(-c3cccc(c3)C#N)c2c(=O)n(C)c1=O)c1nc(Cl)cs1
: