Target
Carbonic anhydrase 1
Ligand
BDBM222059
Substrate
Meas. Tech.
Esterase Activity Assay
pH
7.4±n/a
Temperature
298.15±n/a K
Ki
0.5491±0.1268 nM
IC50
0.6106±0.0 nM
Comments
extracted
Citation
 Kocyigit, UMBudak, YGürdere, MBTekin, Å¿Köprülü, TKErtürk, FÖzcan, KGülçin, Ä°Ceylan, M Synthesis, characterization, anticancer, antimicrobial and carbonic anhydrase inhibition profiles of novel (3aR,4S,7R,7aS)-2-(4-((E)-3-(3-aryl)acryloyl) phenyl)-3a,4,7,7a-tetrahydro-1H-4,7-methanoisoindole-1,3(2H)-dione derivatives. Bioorg Chem 70:118-125 (2017)  
Target
Name:
Carbonic anhydrase 1
Synonyms:
CA-I CAB Carbonate dehydratase I Carbonic anhydrase 1 (CA I) Carbonic anhydrase 1 (Recombinant CA I) Carbonic anhydrase B Carbonic anhydrase I (CA I) Carbonic anhydrase I (CAI) Carbonic anhydrase isoenzyme I (hCA I) | hCA
Type:
Enzyme
Mol. Mass.:
28873.37
Organism:
Homo sapiens (Human)
Description:
P00915
Residue:
261
  
Inhibitor
Name:
BDBM222059
Synonyms:
(3aR,4S,7R,7aS)-2-(4-((E)-3-(pyridin-4-yl)acryloyl)phenyl)-3a,4,7,7a-tetrahydro-1H-4,7-methanoisoindole-1,3(2H)-dione (7n)
Type:
Small organic molecule
Emp. Form.:
C23H18N2O3
Mol. Mass.:
370.4006
SMILES:
O=C(\C=C\c1ccncc1)c1ccc(cc1)N1C(=O)[C@H]2[C@@H]3C[C@@H](C=C3)[C@H]2C1=O
: