Target
Chymotrypsinogen A
Ligand
BDBM50289012
Substrate
Meas. Tech.
α-Chymotrypsin Inhibition Assay
pH
7.6±n/a
IC50
6.5e+3± 2e+2 nM
Comments
extracted
Citation
 Marasini, BPRahim, FPerveen, SKarim, AMohammed Khan, KAtta-Ur-Rahman, nullChoudhary, MI Synthesis, structure-activity relationships studies of benzoxazinone derivatives as a-chymotrypsin inhibitors. Bioorg Chem 70:210-221 (2017)  
Target
Name:
Chymotrypsinogen A
Synonyms:
Alpha-chymotrypsin Chymotrypsin A Chymotrypsin A chain B Chymotrypsinogen A | alpha-Chymotrypsin (α-Chymotrypsin)
Type:
Serine protease
Mol. Mass.:
25670.88
Organism:
Bos taurus (bovine)
Description:
Residue:
245
  
Inhibitor
Name:
BDBM50289012
Synonyms:
2-(2-Fluoro-phenyl)-benzo[d][1,3]oxazin-4-one CHEMBL161656
Type:
Small organic molecule
Emp. Form.:
C14H8FNO2
Mol. Mass.:
241.2172
SMILES:
Fc1ccccc1-c1nc2ccccc2c(=O)o1
: