Target
Solute carrier family 22 member 12
Ligand
BDBM290468
Substrate
Meas. Tech.
hURAT1 Inhibition Assay
IC50
24.0±n/a nM
Citation
 Xu, ZZhang, NSun, QWu, T Condensed ring derivative, and preparation method, intermediate, pharmaceutical composition and use thereof US Patent  US10100016 Publication Date 10/16/2018 
Target
Name:
Solute carrier family 22 member 12
Synonyms:
OATL4 RST S22AC_HUMAN Solute carrier family 22 member 12 URAT1 Urate anion exchanger 1 (URAT1) | Uric Acid Transporter 1 (URAT1)
Type:
Enzyme
Mol. Mass.:
59638.65
Organism:
Homo sapiens (Human)
Description:
Q96S37
Residue:
553
  
Inhibitor
Name:
BDBM290468
Synonyms:
3-[4-(4-Cyanonaphthalen-1-yl)thieno[2,3-c]pyridin-2-yl] butyric Acid | US10100016, Compound 42
Type:
Small organic molecule
Emp. Form.:
C22H15ClN2O2S
Mol. Mass.:
406.885
SMILES:
CC(Cl)(CC(O)=O)c1cc2c(cncc2s1)-c1ccc(C#N)c2ccccc12
: