Target
Solute carrier family 22 member 12
Ligand
BDBM290490
Substrate
Meas. Tech.
hURAT1 Inhibition Assay
IC50
18.0±n/a nM
Citation
 Xu, ZZhang, NSun, QWu, T Condensed ring derivative, and preparation method, intermediate, pharmaceutical composition and use thereof US Patent  US10100016 Publication Date 10/16/2018 
Target
Name:
Solute carrier family 22 member 12
Synonyms:
OATL4 RST S22AC_HUMAN Solute carrier family 22 member 12 URAT1 Urate anion exchanger 1 (URAT1) | Uric Acid Transporter 1 (URAT1)
Type:
Enzyme
Mol. Mass.:
59638.65
Organism:
Homo sapiens (Human)
Description:
Q96S37
Residue:
553
  
Inhibitor
Name:
BDBM290490
Synonyms:
1-{[4-(4-cyanonaphthalen-1-yl)isoquinolin-6-yl]thio}cyclobutane-1-carboxylic Acid | US10100016, Compound 24
Type:
Small organic molecule
Emp. Form.:
C25H18N2O2S
Mol. Mass.:
410.488
SMILES:
OC(=O)C1(CCC1)Sc1ccc2cncc(-c3ccc(C#N)c4ccccc34)c2c1
: