Target
Alkaline phosphatase, tissue-nonspecific isozyme
Ligand
BDBM222181
Substrate
Meas. Tech.
Alkaline Phosphatase Inhibition Assay
pH
9.8±n/a
Temperature
310.15±n/a K
IC50
4.6e+2± 1e+1 nM
Comments
extracted
Citation
 Bhatti, HAKhatoon, MAl-Rashida, MBano, HIqbal, NZaib-Un-Nisa, nullYousuf, SKhan, KMHameed, AIqbal, J Facile dimethyl amino group triggered cyclic sulfonamides synthesis and evaluation as alkaline phosphatase inhibitors. Bioorg Chem 71:10-18 (2017)  
Target
Name:
Alkaline phosphatase, tissue-nonspecific isozyme
Synonyms:
ALPL Alkaline phosphatase liver/bone/kidney isozyme PPBT_BOVIN Tissue non-specific alkaline phosphatase (TNAP)
Type:
Protein
Mol. Mass.:
57195.60
Organism:
Bos taurus (Cattle)
Description:
P09487
Residue:
524
  
Inhibitor
Name:
BDBM222181
Synonyms:
6-(Dimethylamino)-3-(4'-methylphenyl)-2,3-dihydronaphtho[1,8-de][1,2]thiazine 1,1-dioxide (7c)
Type:
Small organic molecule
Emp. Form.:
C20H20N2O2S
Mol. Mass.:
352.45
SMILES:
CN(C)c1ccc2C(NS(=O)(=O)c3cccc1c23)c1ccc(C)cc1
: